{"text_format":"1","workbook":"xlsx","n_sheets":7,"sheets":["UdenMakro","Oversigt Total","Budget indtastning","MånedsBudget"," ","Log","Hjælp"],"not_rendered":{"charts":1,"images":3,"macros":1,"external_links":0,"defined_names":9,"comments":1,"pivot_tables":0},"unopened":[],"bounds":{"document_bytes":16777216,"sheet_cells":100000,"rows_first":2000,"rows_last":500,"rows_between":2000,"halvings":0,"cell_chars":16384,"cell_head_chars":4096},"cells_cut":0,"cells_raw":0,"read":"whole","date_system":"1900"}

{"sheet":"UdenMakro","index":0,"n_rows":19,"n_cols":12,"rows_kept":19,"cut":false,"hidden":false,"merged":[]}
[]
[null,null,"1. Ups… DET VIRKER IKKE",null,null,null,null,null,null,null,null,"3. Når du har aktiveret indholdet,"]
[null,null,"Men det kan det heldigvis komme til.",null,null,null,null,null,null,null,null,{"$f":"HYPERLINK(\"[PrivatBudget.xlsm]'Oversigt Total'!A1\",\"KLIK HER for at fortsætte\")","v":"KLIK HER for at fortsætte"}]
[]
[null,null,"2. Klik på knappen for at tillade programmet at køre"]
[]
[]
[]
[]
[]
{"$rows_left_out":10}
{"sheet":"Oversigt Total","index":1,"n_rows":34,"n_cols":17,"rows_kept":34,"cut":false,"hidden":false,"merged":[[0,11,0,13],[11,15,11,16],[0,6,1,8]]}
[null,null,null,null,null,null,"PrivatBudget",null,null,3.4]
[]
[null,null,null,null,null,null,null,{"$f":"\"Budget for perioden: \"&TEXT('Oversigt Total'!C15,\"mmmm åååå\") & \" - \" &TEXT('Oversigt Total'!N15,\"mmmm åååå\")","v":"Budget for perioden: januar 2024 - december 2024"}]
[null,null,null,null,null,null,"År",null,null,null,null,null,null,null,null,"Navigation"]
[null,"Start saldo:",1000,"Optimal slutsaldo",null,"Indtægter:",{"$f":"SUM(MånedsBudget!B9:B13)","v":1650},{"$f":"G5/12","v":137.5},null,"Saldo nu:",{"$f":"IF(ISERROR(VLOOKUP(TODAY(),'Budget indtastning'!$B$5:$C$371,2,FALSE)),0,VLOOKUP(TODAY(),'Budget indtastning'!$B$5:$C$371,2,FALSE))","v":1050}]
[null,"Slut saldo:",{"$f":"N34","v":1050},{"$f":"-1*MINA('Budget indtastning'!C6:C371)+C5","v":0},null,"Ekstra indbetalinger",{"$f":"MånedsBudget!B31","v":0},{"$f":"G6/12","v":0},null,"Maksimum saldo: ",{"$f":"MAXA(C23:N23)","v":1650}]
[null,{"$f":"IF(C7>=0,\"Opsparing:\",\"Underskud:\")","v":"Opsparing:"},{"$f":"C6-C5","v":50},null,null,"Indtægter total:",{"$f":"SUM(C16:N16)","v":1650},137.5,null,"Minimum saldo: ",{"$f":"MINA(C22:N22)","v":1000}]
[null,null,null,null,null,null,null,null,null,"Dage med minimum saldo:",{"$f":"COUNTIF('Budget indtastning'!C6:C371,K7)","v":1}]
[null,null,null,null,null,"Budgetudgifter",{"$f":"SUM(MånedsBudget!B35:B134)","v":1600},133.33333333333334,null,"Dage med overtræk:",{"$f":"COUNTIF('Budget indtastning'!C6:C371,\"<0\")","v":0}]
[null,null,null,null,null,"Ekstra hævninger",{"$f":"MånedsBudget!B32","v":0},0,null,{"$f":"IF(G13>0,\"I alt opsparing i %: \",IF(G13<0,\"I alt nedsparing i %: \",\"Kontoen går lige op med: \"))","v":"I alt opsparing i %: "},{"$f":"IF(ISERROR(G13/G7),0,G13/G7)","v":3.0303030303030304E-2},null,null,null,null,"Opsætning"]
{"$rows_left_out":25}
{"sheet":"Budget indtastning","index":2,"n_rows":371,"n_cols":124,"rows_kept":371,"cut":false,"hidden":false,"merged":[[2,0,2,1],[1,0,1,1],[3,0,3,1],[0,0,0,1]]}
[{"$f":"('Oversigt Total'!G1)","v":"PrivatBudget"},null,"Indbetalinger →",null,null,null,null,null,null,null,null,null,null,null,null,null,null,null,null,null,null,null,null,null,"Udgifter ↓→"]
[{"$f":"TODAY()","v":"2024-01-08"}]
["Fremhæv aktive post",null,"← Aktuel Saldo","Indbetaling 1","Indbetaling 2","Indbetaling 3","Indbetaling 4","Indbetaling 5"," "," "," "," "," "," "," "," "," "," "," "," "," "," "," ","Ekstra Indbetaling / hævning","Renter & gebyr","Budgetpost 1","Budgetpost 2","Budgetpost 3","Budgetpost 4"," "," "," "," "," "," "," "," "," "," "," "," "," "," "," "," "," "," "," "," "," "," "," "," "," "," "," "," "," "," "," "," "," "," "," "," "," "," "," "," "," "," "," "," "," "," "," "," "," "," "," "," "," "," "," "," "," "," "," "," "," "," "," "," "," "," "," "," "," "," "," "," "," "," "," "," "," "," "," "," "," "," "," "," "," "," "," "," "," "," "," "," "," "," "," "]
["Nej"]
[null,null,null,{"$f":"SUM(D6:D371)","v":0},{"$f":"SUM(E6:E371)","v":1650},{"$f":"SUM(F6:F371)","v":0},{"$f":"SUM(G6:G371)","v":0},{"$f":"SUM(H6:H371)","v":0},{"$f":"SUM(I6:I371)","v":0},0,0,0,0,0,0,0,0,0,0,0,0,0,0,0,{"$f":"SUM(Y6:Y371)","v":0},{"$f":"SUM(Z6:Z371)","v":1000},{"$f":"SUM(AA6:AA371)","v":100},{"$f":"SUM(AB6:AB371)","v":300},{"$f":"SUM(AC6:AC371)","v":200},{"$f":"SUM(AD6:AD371)","v":0},0,0,0,0,{"$f":"SUM(AI6:AI371)","v":0},0,0,0,0,0,0,0,0,0,0,0,0,0,0,0,0,{"$f":"SUM(AZ6:AZ371)","v":0},0,0,0,0,0,0,0,0,0,0,0,0,0,0,0,0,0,0,0,0,0,0,0,0,0,0,0,0,0,0,0,0,0,0,0,0,0,0,0,0,0,0,0,0,0,0,0,0,0,0,0,0,0,0,0,0,0,0,0,0,0,0,0,0,0,0,0,0,0,0,0,0]
[{"$f":"WEEKDAY(B6)","v":"1900-01-02"},{"$f":"' '!C14","v":"2024-01-01"},{"$f":"IF(B6='Oversigt Total'!$K$13,ROUND('Oversigt Total'!C5+SUM($E6:$X6)+'Oversigt Total'!$K$12,2),ROUND('Oversigt Total'!C5+SUM($E6:$X6),2))-SUM($Y6:$DT6)","v":1000}]
[{"$f":"WEEKDAY(B7)","v":"1900-01-03"},{"$f":"B6+1","v":"2024-01-02"},{"$f":"ROUND(C6-SUM(OFFSET(C7,0,22,1,100)),2)+IF(B7='Oversigt Total'!$K$13,SUM(OFFSET(C7,0,1,1,21))+'Oversigt Total'!$K$12,SUM(OFFSET(C7,0,1,1,21)))","v":1650},null,1650,null,null,null,null,null,null,null,null,null,null,null,null,null,null,null,null,null,null,null,null,1000]
["1900-01-04",{"$f":"B7+1","v":"2024-01-03"},{"$f":"ROUND(C7-SUM(OFFSET(C8,0,22,1,100)),2)+IF(B8='Oversigt Total'!$K$13,SUM(OFFSET(C8,0,1,1,21))+'Oversigt Total'!$K$12,SUM(OFFSET(C8,0,1,1,21)))","v":1350},null,null,null,null,null,null,null,null,null,null,null,null,null,null,null,null,null,null,null,null,null,null,null,100,null,200]
["1900-01-05","2024-01-04",{"$f":"ROUND(C8-SUM(OFFSET(C9,0,22,1,100)),2)+IF(B9='Oversigt Total'!$K$13,SUM(OFFSET(C9,0,1,1,21))+'Oversigt Total'!$K$12,SUM(OFFSET(C9,0,1,1,21)))","v":1050},null,null,null,null,null,null,null,null,null,null,null,null,null,null,null,null,null,null,null,null,null,null,null,null,300]
["1900-01-06","2024-01-05",{"$f":"ROUND(C9-SUM(OFFSET(C10,0,22,1,100)),2)+IF(B10='Oversigt Total'!$K$13,SUM(OFFSET(C10,0,1,1,21))+'Oversigt Total'!$K$12,SUM(OFFSET(C10,0,1,1,21)))","v":1050}]
{"$rows_left_out":362}
{"sheet":"MånedsBudget","index":3,"n_rows":142,"n_cols":18,"rows_kept":142,"cut":false,"hidden":false,"merged":[]}
["Privatbudget",{"$f":"\"version \"&'Oversigt Total'!J1","v":"version 3,4"},null,null,null,null,null,null,{"$f":"\"Budget for perioden: \"&TEXT('Oversigt Total'!C15,\"mmmm åååå\") & \" - \" &TEXT('Oversigt Total'!N15,\"mmmm åååå\")","v":"Budget for perioden: januar 2024 - december 2024"}]
[]
[]
["Budgetposter","Sum pr. år ↓",null,"Gns. pr. md. ↓",null,{"$f":"PROPER(TEXT(TRANSPOSE(' '!C14:C25), \"mmmm\"))","v":"Januar"},"Februar","Marts","April","Maj","Juni","Juli","August","September","Oktober","November","December","[kolonne]"]
[0,null,null,null,null,{"$f":"TRANSPOSE(' '!B14:B25)","v":1},2,3,4,5,6,7,8,9,10,11,12]
[0,null,null,null,null,{"$f":"TRANSPOSE(YEAR(' '!C14:C25))","v":2024},2024,2024,2024,2024,2024,2024,2024,2024,2024,2024,2024]
["[System]"]
["Indtægter ↓"]
[{"$f":"TRANSPOSE('Budget indtastning'!D3:W3)","v":"Indbetaling 1"},{"$f":"SUM(F9:Q9)","v":0},null,{"$f":"B9/12","v":0},null,{"$f":"SUMPRODUCT((MONTH('Budget indtastning'!$B$6:$B$371)=F$5)*(YEAR('Budget indtastning'!$B$6:$B$371)=F$6)+0,INDIRECT(\"'Budget indtastning'!$\"&$R9&\"6:\"&$R9&\"371\"))","v":0},{"$f":"SUMPRODUCT((MONTH('Budget indtastning'!$B$6:$B$371)=G$5)*(YEAR('Budget indtastning'!$B$6:$B$371)=G$6)+0,INDIRECT(\"'Budget indtastning'!$\"&$R9&\"6:\"&$R9&\"371\"))","v":0},{"$f":"SUMPRODUCT((MONTH('Budget indtastning'!$B$6:$B$371)=H$5)*(YEAR('Budget indtastning'!$B$6:$B$371)=H$6)+0,INDIRECT(\"'Budget indtastning'!$\"&$R9&\"6:\"&$R9&\"371\"))","v":0},{"$f":"SUMPRODUCT((MONTH('Budget indtastning'!$B$6:$B$371)=I$5)*(YEAR('Budget indtastning'!$B$6:$B$371)=I$6)+0,INDIRECT(\"'Budget indtastning'!$\"&$R9&\"6:\"&$R9&\"371\"))","v":0},{"$f":"SUMPRODUCT((MONTH('Budget indtastning'!$B$6:$B$371)=J$5)*(YEAR('Budget indtastning'!$B$6:$B$371)=J$6)+0,INDIRECT(\"'Budget indtastning'!$\"&$R9&\"6:\"&$R9&\"371\"))","v":0},{"$f":"SUMPRODUCT((MONTH('Budget indtastning'!$B$6:$B$371)=K$5)*(YEAR('Budget indtastning'!$B$6:$B$371)=K$6)+0,INDIRECT(\"'Budget indtastning'!$\"&$R9&\"6:\"&$R9&\"371\"))","v":0},{"$f":"SUMPRODUCT((MONTH('Budget indtastning'!$B$6:$B$371)=L$5)*(YEAR('Budget indtastning'!$B$6:$B$371)=L$6)+0,INDIRECT(\"'Budget indtastning'!$\"&$R9&\"6:\"&$R9&\"371\"))","v":0},{"$f":"SUMPRODUCT((MONTH('Budget indtastning'!$B$6:$B$371)=M$5)*(YEAR('Budget indtastning'!$B$6:$B$371)=M$6)+0,INDIRECT(\"'Budget indtastning'!$\"&$R9&\"6:\"&$R9&\"371\"))","v":0},{"$f":"SUMPRODUCT((MONTH('Budget indtastning'!$B$6:$B$371)=N$5)*(YEAR('Budget indtastning'!$B$6:$B$371)=N$6)+0,INDIRECT(\"'Budget indtastning'!$\"&$R9&\"6:\"&$R9&\"371\"))","v":0},{"$f":"SUMPRODUCT((MONTH('Budget indtastning'!$B$6:$B$371)=O$5)*(YEAR('Budget indtastning'!$B$6:$B$371)=O$6)+0,INDIRECT(\"'Budget indtastning'!$\"&$R9&\"6:\"&$R9&\"371\"))","v":0},{"$f":"SUMPRODUCT((MONTH('Budget indtastning'!$B$6:$B$371)=P$5)*(YEAR('Budget indtastning'!$B$6:$B$371)=P$6)+0,INDIRECT(\"'Budget indtastning'!$\"&$R9&\"6:\"&$R9&\"371\"))","v":0},{"$f":"SUMPRODUCT((MONTH('Budget indtastning'!$B$6:$B$371)=Q$5)*(YEAR('Budget indtastning'!$B$6:$B$371)=Q$6)+0,INDIRECT(\"'Budget indtastning'!$\"&$R9&\"6:\"&$R9&\"371\"))","v":0},"d"]
["Indbetaling 2",{"$f":"SUM(F10:Q10)","v":1650},null,{"$f":"B10/12","v":137.5},null,{"$f":"SUMPRODUCT((MONTH('Budget indtastning'!$B$6:$B$371)=F$5)*(YEAR('Budget indtastning'!$B$6:$B$371)=F$6)+0,INDIRECT(\"'Budget indtastning'!$\"&$R10&\"6:\"&$R10&\"371\"))","v":1650},{"$f":"SUMPRODUCT((MONTH('Budget indtastning'!$B$6:$B$371)=G$5)*(YEAR('Budget indtastning'!$B$6:$B$371)=G$6)+0,INDIRECT(\"'Budget indtastning'!$\"&$R10&\"6:\"&$R10&\"371\"))","v":0},{"$f":"SUMPRODUCT((MONTH('Budget indtastning'!$B$6:$B$371)=H$5)*(YEAR('Budget indtastning'!$B$6:$B$371)=H$6)+0,INDIRECT(\"'Budget indtastning'!$\"&$R10&\"6:\"&$R10&\"371\"))","v":0},{"$f":"SUMPRODUCT((MONTH('Budget indtastning'!$B$6:$B$371)=I$5)*(YEAR('Budget indtastning'!$B$6:$B$371)=I$6)+0,INDIRECT(\"'Budget indtastning'!$\"&$R10&\"6:\"&$R10&\"371\"))","v":0},{"$f":"SUMPRODUCT((MONTH('Budget indtastning'!$B$6:$B$371)=J$5)*(YEAR('Budget indtastning'!$B$6:$B$371)=J$6)+0,INDIRECT(\"'Budget indtastning'!$\"&$R10&\"6:\"&$R10&\"371\"))","v":0},{"$f":"SUMPRODUCT((MONTH('Budget indtastning'!$B$6:$B$371)=K$5)*(YEAR('Budget indtastning'!$B$6:$B$371)=K$6)+0,INDIRECT(\"'Budget indtastning'!$\"&$R10&\"6:\"&$R10&\"371\"))","v":0},{"$f":"SUMPRODUCT((MONTH('Budget indtastning'!$B$6:$B$371)=L$5)*(YEAR('Budget indtastning'!$B$6:$B$371)=L$6)+0,INDIRECT(\"'Budget indtastning'!$\"&$R10&\"6:\"&$R10&\"371\"))","v":0},{"$f":"SUMPRODUCT((MONTH('Budget indtastning'!$B$6:$B$371)=M$5)*(YEAR('Budget indtastning'!$B$6:$B$371)=M$6)+0,INDIRECT(\"'Budget indtastning'!$\"&$R10&\"6:\"&$R10&\"371\"))","v":0},{"$f":"SUMPRODUCT((MONTH('Budget indtastning'!$B$6:$B$371)=N$5)*(YEAR('Budget indtastning'!$B$6:$B$371)=N$6)+0,INDIRECT(\"'Budget indtastning'!$\"&$R10&\"6:\"&$R10&\"371\"))","v":0},{"$f":"SUMPRODUCT((MONTH('Budget indtastning'!$B$6:$B$371)=O$5)*(YEAR('Budget indtastning'!$B$6:$B$371)=O$6)+0,INDIRECT(\"'Budget indtastning'!$\"&$R10&\"6:\"&$R10&\"371\"))","v":0},{"$f":"SUMPRODUCT((MONTH('Budget indtastning'!$B$6:$B$371)=P$5)*(YEAR('Budget indtastning'!$B$6:$B$371)=P$6)+0,INDIRECT(\"'Budget indtastning'!$\"&$R10&\"6:\"&$R10&\"371\"))","v":0},{"$f":"SUMPRODUCT((MONTH('Budget indtastning'!$B$6:$B$371)=Q$5)*(YEAR('Budget indtastning'!$B$6:$B$371)=Q$6)+0,INDIRECT(\"'Budget indtastning'!$\"&$R10&\"6:\"&$R10&\"371\"))","v":0},"e"]
{"$rows_left_out":133}
{"sheet":" ","index":4,"n_rows":25,"n_cols":5,"rows_kept":25,"cut":false,"hidden":true,"merged":[]}
[]
[]
[]
[]
[]
[]
[]
[]
[]
[]
{"$rows_left_out":16}
{"sheet":"Log","index":5,"n_rows":0,"n_cols":0,"rows_kept":0,"cut":false,"hidden":false,"merged":[]}

{"sheet":"Hjælp","index":6,"n_rows":62,"n_cols":5,"rows_kept":62,"cut":false,"hidden":false,"merged":[]}
[{"$f":"\"Privatbudget \"  & \"version \" & 'Oversigt Total'!J1","v":"Privatbudget version 3,4"}]
[]
[]
["Arket \"Budget indtastning\"",null,null,"I dette ark angiver du dine budgetterede udgifter på dagsniveau samt dine indbetalinger og tilretninger"]
[]
[null,null,null,"Saldo","Indestående på kontoen på det aktuelle tidspunkt"]
[null,null,null,"Fast indbetaling 1 - 5","Her angiver du dine faste indbetalinger på kontoen, f.eks hver måned."]
[null,null,null,"Indbetaling / hævning","Her kan du tilrette saldoen ved at indskyde eller hæve på kontoen. (negative tal = hævning)"]
[null,null,null,"Renter & gebyr","Her kan du skrive de forventede / realiserede renter frra din budgetkonto på. (negative tal = negative renter)"]
[null,null,null,"Budget udgifter","Her skriver du typen af udgift som du vil budgettere (Max 48), årstotalen vil fremgå i cellen under navnet"]
{"$rows_left_out":52}